Reaction Details
TargetReverse transcriptase/RNaseH
LigandBDBM50175621
Substrate/Competitorn/a
Meas. Tech.ChEMBL_321370 (CHEMBL881514)
IC50 3000±n/a nM
Citation Bonache, MCChamorro, CVelázquez, SDe Clercq, EBalzarini, JBarrios, FRGago, FCamarasa, MJSan-Félix, A Improving the antiviral efficacy and selectivity of HIV-1 reverse transcriptase inhibitor TSAO-T by the introduction of functional groups at the N-3 position. J Med Chem48:6653-60 (2005) 
 
Reverse transcriptase/RNaseH
Name:Reverse transcriptase/RNaseH
Type:PROTEIN
Mol. Mass.:65229.15
Organism:Human immunodeficiency virus 1
Description:ChEMBL_1473730
Residue:566
BDBM50175621
NameBDBM50175621
Synonyms:CHEMBL3143760 | {3-[4-Amino-9-(tert-butyl-dimethyl-silanyloxy)-6-(tert-butyl-dimethyl-silanyloxymethyl)-2,2-dioxo-1,7-dioxa-2lambda*6*-thia-spiro[4.4]non-3-en-8-yl]-5-methyl-2,6-dioxo-3,6-dihydro-2H-pyrimidin-1-yl}-acetic acid methyl ester
TypeSmall organic molecule
Emp. Form.C27H47N3O10SSi2
Mol. Mass.661.912
SMILESCOC(=O)Cn1c(=O)c(C)cn([C@@H]2O[C@H](CO[Si](C)(C)C(C)(C)C)[C@@]3(OS(=O)(=O)C=C3N)[C@H]2O[Si](C)(C)C(C)(C)C)c1=O