Reaction Details
TargetSodium-dependent serotonin transporter
LigandBDBM50175637
Substrate/Competitorn/a
Meas. Tech.ChEMBL_329124 (CHEMBL863423)
Ki 11.3±n/a nM
Citation Tamagnan, GAlagille, DFu, XKula, NSBaldessarini, RJInnis, RBBaldwin, RM Synthesis and monoamine transporter affinity of new 2beta-carbomethoxy-3beta-[aryl or heteroaryl]phenyltropanes. Bioorg Med Chem Lett16:217-20 (2005) 
 
Sodium-dependent serotonin transporter
Name:Sodium-dependent serotonin transporter
Type:Multi-pass membrane protein
Mol. Mass.:70168.43
Organism:Rattus norvegicus (rat)
Description:P31652
Residue:630
BDBM50175637
NameBDBM50175637
Synonyms:CHEMBL383572 | methyl 8-methyl-3-(4-(pyrazin-2-yl)phenyl)-8-aza-bicyclo[3.2.1]octane-2-carboxylate
TypeSmall organic molecule
Emp. Form.C20H23N3O2
Mol. Mass.337.4155
SMILESCOC(=O)C1C2CCC(CC1c1ccc(cc1)-c1cnccn1)N2C