Reaction Details
TargetSodium-dependent serotonin transporter
LigandBDBM50175646
Substrate/Competitorn/a
Meas. Tech.ChEMBL_329124 (CHEMBL863423)
Ki 0.41±n/a nM
Citation Tamagnan, GAlagille, DFu, XKula, NSBaldessarini, RJInnis, RBBaldwin, RM Synthesis and monoamine transporter affinity of new 2beta-carbomethoxy-3beta-[aryl or heteroaryl]phenyltropanes. Bioorg Med Chem Lett16:217-20 (2005) 
 
Sodium-dependent serotonin transporter
Name:Sodium-dependent serotonin transporter
Type:Multi-pass membrane protein
Mol. Mass.:70168.43
Organism:Rattus norvegicus (rat)
Description:P31652
Residue:630
BDBM50175646
NameBDBM50175646
Synonyms:3-(3',5'-difluoro-biphenyl-4-yl)-8-methyl-8-aza-bicyclo[3.2.1]octane-2-carboxylic acid methyl ester | CHEMBL200748
TypeSmall organic molecule
Emp. Form.C22H23F2NO2
Mol. Mass.371.4203
SMILESCOC(=O)C1C2CCC(CC1c1ccc(cc1)-c1cc(F)cc(F)c1)N2C