Reaction Details
TargetInhibitor of nuclear factor kappa-B kinase subunit beta
LigandBDBM50175685
Substrate/Competitorn/a
Meas. Tech.ChEMBL_327452 (CHEMBL859878)
IC50 200±n/a nM
Citation Waelchli, RBollbuck, BBruns, CBuhl, TEder, JFeifel, RHersperger, RJanser, PRevesz, LZerwes, HGSchlapbach, A Design and preparation of 2-benzamido-pyrimidines as inhibitors of IKK. Bioorg Med Chem Lett16:108-12 (2005) 
 
Inhibitor of nuclear factor kappa-B kinase subunit beta
Name:Inhibitor of nuclear factor kappa-B kinase subunit beta
Type:Serine/threonine-protein kinase
Mol. Mass.:86554.39
Organism:Homo sapiens (Human)
Description:GST-tagged IKK-2 was expressed in High Five cells and purified.
Residue:756
BDBM50175685
NameBDBM50175685
Synonyms:4-(4-(benzo[b]thiophen-2-yl)pyrimidin-2-ylamino)-N-(2-(dimethylamino)ethyl)benzamide | CHEMBL200832
TypeSmall organic molecule
Emp. Form.C23H23N5OS
Mol. Mass.417.527
SMILESCN(C)CCNC(=O)c1ccc(Nc2nccc(n2)-c2cc3ccccc3s2)cc1