Reaction Details
TargetInhibitor of nuclear factor kappa-B kinase subunit alpha/Inhibitor of nuclear factor kappa-B kinase subunit beta/NF-kappa-B essential modulator
LigandBDBM50175686
Substrate/Competitorn/a
Meas. Tech.ChEMBL_327457 (CHEMBL862761)
IC50 200±n/a nM
Citation Waelchli, RBollbuck, BBruns, CBuhl, TEder, JFeifel, RHersperger, RJanser, PRevesz, LZerwes, HGSchlapbach, A Design and preparation of 2-benzamido-pyrimidines as inhibitors of IKK. Bioorg Med Chem Lett16:108-12 (2005) 
 
Inhibitor of nuclear factor kappa-B kinase subunit alpha/Inhibitor of nuclear factor kappa-B kinase subunit beta/NF-kappa-B essential modulator
Name:Inhibitor of nuclear factor kappa-B kinase subunit alpha/Inhibitor of nuclear factor kappa-B kinase subunit beta/NF-kappa-B essential modulator
Type:n/a
Mol. Mass.:n/a
Description:ASSAY_ID of EBI is 327454
Components:This complex has 3 components.
Component 1
Name:Inhibitor of nuclear factor kappa-B kinase subunit alpha
Synonyms:CHUK I-kappa-B kinase 1 IKK-A IKK1 IKKA IkBKA Inhibitor of NF-kappa-B kinase alpha/beta Nuclear factor NF-kappa-B inhibitor kinase alpha TCF16 | Transcription factor 16
Type:PROTEIN
Mol. Mass.:84642.21
Organism:Homo sapiens (Human)
Description:ChEMBL_327453
Residue:745
Component 2
Name:Inhibitor of nuclear factor kappa-B kinase subunit beta
Synonyms:I-kappa-B Kinase 2 (IKK-beta) I-kappa-B-kinase beta IKBKB IKK-beta IKK2/IKK1 IKKB_HUMAN Inhibitor of nuclear factor kappa B kinase beta subunit Nuclear factor NF-kappa-B inhibitor kinase beta
Type:Serine/threonine-protein kinase
Mol. Mass.:86554.39
Organism:Homo sapiens (Human)
Description:GST-tagged IKK-2 was expressed in High Five cells and purified.
Residue:756
Component 3
Name:NF-kappa-B essential modulator
Synonyms:FIP3 Inhibitor of NF-kappa-B kinase (IKK) NEMO_HUMAN | NF-kappa-B essential modulator
Type:PROTEIN
Mol. Mass.:48190.12
Organism:Homo sapiens (Human)
Description:ChEMBL_84013
Residue:419
Component 4
Name:Inhibitor of nuclear factor kappa-B kinase subunit alpha
Synonyms:CHUK I-kappa-B kinase 1 IKK-A IKK1 IKKA IkBKA Inhibitor of NF-kappa-B kinase alpha/beta Nuclear factor NF-kappa-B inhibitor kinase alpha TCF16 | Transcription factor 16
Type:PROTEIN
Mol. Mass.:84642.21
Organism:Homo sapiens (Human)
Description:ChEMBL_327453
Residue:745
BDBM50175686
NameBDBM50175686
Synonyms:(4-(4-(5-(4-hydroxybutyl)thiophen-2-yl)pyrimidin-2-ylamino)phenyl)(4-(pyrrolidin-1-yl)piperidin-1-yl)methanone | CHEMBL200106
TypeSmall organic molecule
Emp. Form.C28H35N5O2S
Mol. Mass.505.675
SMILESOCCCCc1ccc(s1)-c1ccnc(Nc2ccc(cc2)C(=O)N2CCC(CC2)N2CCCC2)n1