Reaction Details
TargetInhibitor of nuclear factor kappa-B kinase subunit alpha
LigandBDBM50175701
Substrate/Competitorn/a
Meas. Tech.ChEMBL_327453 (CHEMBL859877)
IC50 30.0±n/a nM
Citation Waelchli, RBollbuck, BBruns, CBuhl, TEder, JFeifel, RHersperger, RJanser, PRevesz, LZerwes, HGSchlapbach, A Design and preparation of 2-benzamido-pyrimidines as inhibitors of IKK. Bioorg Med Chem Lett16:108-12 (2005) 
 
Inhibitor of nuclear factor kappa-B kinase subunit alpha
Name:Inhibitor of nuclear factor kappa-B kinase subunit alpha
Type:PROTEIN
Mol. Mass.:84642.21
Organism:Homo sapiens (Human)
Description:ChEMBL_327453
Residue:745
BDBM50175701
NameBDBM50175701
Synonyms:(4-(4-(5-(3-amino-3-methylbutyl)thiophen-2-yl)pyrimidin-2-ylamino)phenyl)(4-(pyrrolidin-1-yl)piperidin-1-yl)methanone | CHEMBL199837
TypeSmall organic molecule
Emp. Form.C29H38N6OS
Mol. Mass.518.717
SMILESCC(C)(N)CCc1ccc(s1)-c1ccnc(Nc2ccc(cc2)C(=O)N2CCC(CC2)N2CCCC2)n1