Reaction Details
TargetInhibitor of nuclear factor kappa-B kinase subunit alpha
LigandBDBM50175699
Substrate/Competitorn/a
Meas. Tech.ChEMBL_327453 (CHEMBL859877)
IC50 30000±n/a nM
Citation Waelchli, RBollbuck, BBruns, CBuhl, TEder, JFeifel, RHersperger, RJanser, PRevesz, LZerwes, HGSchlapbach, A Design and preparation of 2-benzamido-pyrimidines as inhibitors of IKK. Bioorg Med Chem Lett16:108-12 (2005) 
 
Inhibitor of nuclear factor kappa-B kinase subunit alpha
Name:Inhibitor of nuclear factor kappa-B kinase subunit alpha
Type:PROTEIN
Mol. Mass.:84642.21
Organism:Homo sapiens (Human)
Description:ChEMBL_327453
Residue:745
BDBM50175699
NameBDBM50175699
Synonyms:CHEMBL372160 | N-(2-methyl-4-(5-(2-(4-(4-(pyrrolidin-1-yl)piperidine-1-carbonyl)phenylamino)pyrimidin-4-yl)thiophen-2-yl)butan-2-yl)acetamide
TypeSmall organic molecule
Emp. Form.C31H40N6O2S
Mol. Mass.560.753
SMILESCC(=O)NC(C)(C)CCc1ccc(s1)-c1ccnc(Nc2ccc(cc2)C(=O)N2CCC(CC2)N2CCCC2)n1