Reaction Details
TargetFructose-bisphosphate aldolase A
LigandBDBM50167777
Substrate/Competitorn/a
Meas. Tech.ChEMBL_326982 (CHEMBL867575)
Ki 1000±n/a nM
Citation Gavalda, SBraga, RDax, CVigroux, ABlonski, C N-Sulfonyl hydroxamate derivatives as inhibitors of class II fructose-1,6-diphosphate aldolase. Bioorg Med Chem Lett15:5375-7 (2005) 
 
Fructose-bisphosphate aldolase A
Name:Fructose-bisphosphate aldolase A
Type:PROTEIN
Mol. Mass.:39351.00
Organism:Oryctolagus cuniculus
Description:ChEMBL_813854
Residue:364
BDBM50167777
NameBDBM50167777
Synonyms:2-(hydroxyamino)-2-oxoethyl dihydrogen phosphate Phosphoglycolohydroxamic Acid
TypeSmall organic molecule
Emp. Form.C2H6NO6P
Mol. Mass.171.0459
SMILESONC(=O)COP(O)(O)=O