Reaction Details
TargetFructose-bisphosphate aldolase class 2
LigandBDBM50167776
Substrate/Competitorn/a
Meas. Tech.ChEMBL_326983 (CHEMBL868742)
Ki>1000000±n/a nM
Citation Gavalda, SBraga, RDax, CVigroux, ABlonski, C N-Sulfonyl hydroxamate derivatives as inhibitors of class II fructose-1,6-diphosphate aldolase. Bioorg Med Chem Lett15:5375-7 (2005) 
 
Fructose-bisphosphate aldolase class 2
Name:Fructose-bisphosphate aldolase class 2
Type:PROTEIN
Mol. Mass.:39141.25
Organism:Escherichia coli (strain K12)
Description:ChEMBL_326983
Residue:359
BDBM50167776
NameBDBM50167776
Synonyms:(2-Hydroxycarbamoyl-ethyl)-phosphonic acid CHEMBL196442 | hydrogen 3-(hydroxyamino)-3-oxopropylphosphonate
TypeSmall organic molecule
Emp. Form.C3H8NO5P
Mol. Mass.169.0731
SMILESONC(=O)CCP(O)(O)=O