Reaction Details
TargetDelta-type opioid receptor
LigandBDBM50175719
Substrate/Competitorn/a
Meas. Tech.ChEMBL_328876 (CHEMBL859855)
Ki 18±n/a nM
Citation Trabanco, AAPullan, SAlonso, JMAlvarez, RMAndrés, JIBoeckx, IFernández, JGómez, AIturrino, LJanssens, FELeenaerts, JEDe Lucas, AIMatesanz, EMeert, TSteckler, T 4-Phenyl-4-[1H-imidazol-2-yl]-piperidine derivatives, a novel class of selective delta-opioid agonists. Bioorg Med Chem Lett16:146-9 (2005) 
 
Delta-type opioid receptor
Name:Delta-type opioid receptor
Type:G Protein-Coupled Receptor (GPCR)
Mol. Mass.:40382.98
Organism:Homo sapiens (Human)
Description:Competition binding assays were carried out using membrane preparations from transfected HN9.10 cells that constitutively expressed the delta opioid receptor.
Residue:372
BDBM50175719
NameBDBM50175719
Synonyms:2-(4-(1-benzyl-1H-imidazol-2-yl)-4-phenylpiperidin-1-yl)pyrimidine | CHEMBL202238
TypeSmall organic molecule
Emp. Form.C25H25N5
Mol. Mass.395.4995
SMILESC(c1ccccc1)n1ccnc1C1(CCN(CC1)c1ncccn1)c1ccccc1