Reaction Details
TargetDelta-type opioid receptor
LigandBDBM50175735
Substrate/Competitorn/a
Meas. Tech.ChEMBL_328876 (CHEMBL859855)
Ki 72±n/a nM
Citation Trabanco, AAPullan, SAlonso, JMAlvarez, RMAndrés, JIBoeckx, IFernández, JGómez, AIturrino, LJanssens, FELeenaerts, JEDe Lucas, AIMatesanz, EMeert, TSteckler, T 4-Phenyl-4-[1H-imidazol-2-yl]-piperidine derivatives, a novel class of selective delta-opioid agonists. Bioorg Med Chem Lett16:146-9 (2005) 
 
Delta-type opioid receptor
Name:Delta-type opioid receptor
Type:G Protein-Coupled Receptor (GPCR)
Mol. Mass.:40382.98
Organism:Homo sapiens (Human)
Description:Competition binding assays were carried out using membrane preparations from transfected HN9.10 cells that constitutively expressed the delta opioid receptor.
Residue:372
BDBM50175735
NameBDBM50175735
Synonyms:4-(1-(2-fluorobenzyl)-1H-imidazol-2-yl)-N,4-diphenylpiperidine-1-carboxamide | CHEMBL199871
TypeSmall organic molecule
Emp. Form.C28H27FN4O
Mol. Mass.454.5386
SMILESFc1ccccc1Cn1ccnc1C1(CCN(CC1)C(=O)Nc1ccccc1)c1ccccc1