Reaction Details
TargetDelta-type opioid receptor
LigandBDBM50175718
Substrate/Competitorn/a
Meas. Tech.ChEMBL_328876 (CHEMBL859855)
Ki 161±n/a nM
Citation Trabanco, AAPullan, SAlonso, JMAlvarez, RMAndrés, JIBoeckx, IFernández, JGómez, AIturrino, LJanssens, FELeenaerts, JEDe Lucas, AIMatesanz, EMeert, TSteckler, T 4-Phenyl-4-[1H-imidazol-2-yl]-piperidine derivatives, a novel class of selective delta-opioid agonists. Bioorg Med Chem Lett16:146-9 (2005) 
 
Delta-type opioid receptor
Name:Delta-type opioid receptor
Type:G Protein-Coupled Receptor (GPCR)
Mol. Mass.:40382.98
Organism:Homo sapiens (Human)
Description:Competition binding assays were carried out using membrane preparations from transfected HN9.10 cells that constitutively expressed the delta opioid receptor.
Residue:372
BDBM50175718
NameBDBM50175718
Synonyms:(4-(1-benzyl-1H-imidazol-2-yl)-4-phenylpiperidin-1-yl)(4-methylpiperazin-1-yl)methanone | CHEMBL426470
TypeSmall organic molecule
Emp. Form.C27H33N5O
Mol. Mass.443.5838
SMILESCN1CCN(CC1)C(=O)N1CCC(CC1)(c1nccn1Cc1ccccc1)c1ccccc1