Reaction Details
TargetDelta-type opioid receptor
LigandBDBM50175736
Substrate/Competitorn/a
Meas. Tech.ChEMBL_328876 (CHEMBL859855)
Ki 3696±n/a nM
Citation Trabanco, AAPullan, SAlonso, JMAlvarez, RMAndrés, JIBoeckx, IFernández, JGómez, AIturrino, LJanssens, FELeenaerts, JEDe Lucas, AIMatesanz, EMeert, TSteckler, T 4-Phenyl-4-[1H-imidazol-2-yl]-piperidine derivatives, a novel class of selective delta-opioid agonists. Bioorg Med Chem Lett16:146-9 (2005) 
 
Delta-type opioid receptor
Name:Delta-type opioid receptor
Type:G Protein-Coupled Receptor (GPCR)
Mol. Mass.:40382.98
Organism:Homo sapiens (Human)
Description:Competition binding assays were carried out using membrane preparations from transfected HN9.10 cells that constitutively expressed the delta opioid receptor.
Residue:372
BDBM50175736
NameBDBM50175736
Synonyms:4-(1-benzoyl-1H-imidazol-2-yl)-N,4-diphenylpiperidine-1-carboxamide | CHEMBL199545
TypeSmall organic molecule
Emp. Form.C28H26N4O2
Mol. Mass.450.5316
SMILESO=C(Nc1ccccc1)N1CCC(CC1)(c1nccn1C(=O)c1ccccc1)c1ccccc1