Reaction Details
TargetKappa-type opioid receptor
LigandBDBM50175723
Substrate/Competitorn/a
Meas. Tech.ChEMBL_328878 (CHEMBL859857)
Ki 397±n/a nM
Citation Trabanco, AAPullan, SAlonso, JMAlvarez, RMAndrés, JIBoeckx, IFernández, JGómez, AIturrino, LJanssens, FELeenaerts, JEDe Lucas, AIMatesanz, EMeert, TSteckler, T 4-Phenyl-4-[1H-imidazol-2-yl]-piperidine derivatives, a novel class of selective delta-opioid agonists. Bioorg Med Chem Lett16:146-9 (2005) 
 
Kappa-type opioid receptor
Name:Kappa-type opioid receptor
Type:G Protein-Coupled Receptor (GPCR)
Mol. Mass.:42648.76
Organism:Homo sapiens (Human)
Description:P41145
Residue:380
BDBM50175723
NameBDBM50175723
Synonyms:4-(1-benzyl-1H-imidazol-2-yl)-N-methyl-N,4-diphenylpiperidine-1-carboxamide | CHEMBL199433
TypeSmall organic molecule
Emp. Form.C29H30N4O
Mol. Mass.450.5747
SMILESCN(C(=O)N1CCC(CC1)(c1nccn1Cc1ccccc1)c1ccccc1)c1ccccc1