Reaction Details
TargetKappa-type opioid receptor
LigandBDBM50175719
Substrate/Competitorn/a
Meas. Tech.ChEMBL_328878 (CHEMBL859857)
Ki 505±n/a nM
Citation Trabanco, AAPullan, SAlonso, JMAlvarez, RMAndrés, JIBoeckx, IFernández, JGómez, AIturrino, LJanssens, FELeenaerts, JEDe Lucas, AIMatesanz, EMeert, TSteckler, T 4-Phenyl-4-[1H-imidazol-2-yl]-piperidine derivatives, a novel class of selective delta-opioid agonists. Bioorg Med Chem Lett16:146-9 (2005) 
 
Kappa-type opioid receptor
Name:Kappa-type opioid receptor
Type:G Protein-Coupled Receptor (GPCR)
Mol. Mass.:42648.76
Organism:Homo sapiens (Human)
Description:P41145
Residue:380
BDBM50175719
NameBDBM50175719
Synonyms:2-(4-(1-benzyl-1H-imidazol-2-yl)-4-phenylpiperidin-1-yl)pyrimidine | CHEMBL202238
TypeSmall organic molecule
Emp. Form.C25H25N5
Mol. Mass.395.4995
SMILESC(c1ccccc1)n1ccnc1C1(CCN(CC1)c1ncccn1)c1ccccc1