Reaction Details
TargetKappa-type opioid receptor
LigandBDBM50175730
Substrate/Competitorn/a
Meas. Tech.ChEMBL_328878 (CHEMBL859857)
Ki 46±n/a nM
Citation Trabanco, AAPullan, SAlonso, JMAlvarez, RMAndrés, JIBoeckx, IFernández, JGómez, AIturrino, LJanssens, FELeenaerts, JEDe Lucas, AIMatesanz, EMeert, TSteckler, T 4-Phenyl-4-[1H-imidazol-2-yl]-piperidine derivatives, a novel class of selective delta-opioid agonists. Bioorg Med Chem Lett16:146-9 (2005) 
 
Kappa-type opioid receptor
Name:Kappa-type opioid receptor
Type:G Protein-Coupled Receptor (GPCR)
Mol. Mass.:42648.76
Organism:Homo sapiens (Human)
Description:P41145
Residue:380
BDBM50175730
NameBDBM50175730
Synonyms:CHEMBL197917 | N,4-diphenyl-4-(1-(pyridin-2-ylmethyl)-1H-imidazol-2-yl)piperidine-1-carboxamide
TypeSmall organic molecule
Emp. Form.C27H27N5O
Mol. Mass.437.5362
SMILESO=C(Nc1ccccc1)N1CCC(CC1)(c1nccn1Cc1ccccn1)c1ccccc1