Reaction Details
TargetMu-type opioid receptor
LigandBDBM50175738
Substrate/Competitorn/a
Meas. Tech.ChEMBL_328877 (CHEMBL859856)
Ki>4652±n/a nM
Citation Trabanco, AAPullan, SAlonso, JMAlvarez, RMAndrés, JIBoeckx, IFernández, JGómez, AIturrino, LJanssens, FELeenaerts, JEDe Lucas, AIMatesanz, EMeert, TSteckler, T 4-Phenyl-4-[1H-imidazol-2-yl]-piperidine derivatives, a novel class of selective delta-opioid agonists. Bioorg Med Chem Lett16:146-9 (2005) 
 
Mu-type opioid receptor
Name:Mu-type opioid receptor
Type:G Protein-Coupled Receptor (GPCR)
Mol. Mass.:44789.51
Organism:Homo sapiens (Human)
Description:P35372
Residue:400
BDBM50175738
NameBDBM50175738
Synonyms:4-(1-benzyl-1H-imidazol-2-yl)-N-(3-fluorophenyl)-4-phenylpiperidine-1-carboxamide | CHEMBL199647
TypeSmall organic molecule
Emp. Form.C28H27FN4O
Mol. Mass.454.5386
SMILESFc1cccc(NC(=O)N2CCC(CC2)(c2nccn2Cc2ccccc2)c2ccccc2)c1