Reaction Details
TargetMitogen-activated protein kinase 14
LigandBDBM50175742
Substrate/Competitorn/a
Meas. Tech.ChEMBL_328205 (CHEMBL863917)
IC50 0.45±n/a nM
Citation Bao, JHunt, JAMiao, SRupprecht, KMStelmach, JELiu, LRuzek, RDSinclair, PJPivnichny, JVHop, CEKumar, SZaller, DMShoop, WLO'neill, EAO'keefe, SJThompson, CMCubbon, RMWang, RZhang, WXThompson, JEDoherty, JB p38 MAP kinase inhibitors: metabolically stabilized piperidine-substituted quinolinones and naphthyridinones. Bioorg Med Chem Lett16:64-8 (2005) 
 
Mitogen-activated protein kinase 14
Name:Mitogen-activated protein kinase 14
Type:Serine/threonine-protein kinase
Mol. Mass.:41286.76
Organism:Homo sapiens (Human)
Description:Q16539
Residue:360
BDBM50175742
NameBDBM50175742
Synonyms:7-(8-aza-bicyclo[3.2.1]octan-3-yl)-5-(2-chloro-4-fluorophenyl)-1-(2,6-dichlorophenyl)quinolin-2(1H)-one | CHEMBL199701
TypeSmall organic molecule
Emp. Form.C28H22Cl3FN2O
Mol. Mass.527.844
SMILESFc1ccc(c(Cl)c1)-c1cc(cc2n(-c3c(Cl)cccc3Cl)c(=O)ccc12)C1CC2CCC(C1)N2