Reaction Details
TargetMitogen-activated protein kinase 14
LigandBDBM50175743
Substrate/Competitorn/a
Meas. Tech.ChEMBL_328206 (CHEMBL863945)
IC50 1.3±n/a nM
Citation Bao, JHunt, JAMiao, SRupprecht, KMStelmach, JELiu, LRuzek, RDSinclair, PJPivnichny, JVHop, CEKumar, SZaller, DMShoop, WLO'neill, EAO'keefe, SJThompson, CMCubbon, RMWang, RZhang, WXThompson, JEDoherty, JB p38 MAP kinase inhibitors: metabolically stabilized piperidine-substituted quinolinones and naphthyridinones. Bioorg Med Chem Lett16:64-8 (2005) 
 
Mitogen-activated protein kinase 14
Name:Mitogen-activated protein kinase 14
Type:Serine/threonine-protein kinase
Mol. Mass.:41286.76
Organism:Homo sapiens (Human)
Description:Q16539
Residue:360
BDBM50175743
NameBDBM50175743
Synonyms:CHEMBL199316 | methyl 2-(4-(5-(2-chloro-4-fluorophenyl)-1-(2,6-dichlorophenyl)-2-oxo-1,2-dihydroquinolin-7-yl)piperidin-1-yl)propanoate
TypeSmall organic molecule
Emp. Form.C30H26Cl3FN2O3
Mol. Mass.587.896
SMILESCOC(=O)C(C)N1CCC(CC1)c1cc(-c2ccc(F)cc2Cl)c2ccc(=O)n(-c3c(Cl)cccc3Cl)c2c1