Reaction Details
TargetMitogen-activated protein kinase 14
LigandBDBM50175750
Substrate/Competitorn/a
Meas. Tech.ChEMBL_328206 (CHEMBL863945)
IC50 0.99±n/a nM
Citation Bao, JHunt, JAMiao, SRupprecht, KMStelmach, JELiu, LRuzek, RDSinclair, PJPivnichny, JVHop, CEKumar, SZaller, DMShoop, WLO'neill, EAO'keefe, SJThompson, CMCubbon, RMWang, RZhang, WXThompson, JEDoherty, JB p38 MAP kinase inhibitors: metabolically stabilized piperidine-substituted quinolinones and naphthyridinones. Bioorg Med Chem Lett16:64-8 (2005) 
 
Mitogen-activated protein kinase 14
Name:Mitogen-activated protein kinase 14
Type:Serine/threonine-protein kinase
Mol. Mass.:41286.76
Organism:Homo sapiens (Human)
Description:Q16539
Residue:360
BDBM50175750
NameBDBM50175750
Synonyms:5-(2-chloro-4-fluorophenyl)-1-(2,6-dichlorophenyl)-7-(8-isopropyl-8-aza-bicyclo[3.2.1]octan-3-yl)quinolin-2(1H)-one | CHEMBL380806
TypeSmall organic molecule
Emp. Form.C31H28Cl3FN2O
Mol. Mass.569.924
SMILESCC(C)N1C2CCC1CC(C2)c1cc(-c2ccc(F)cc2Cl)c2ccc(=O)n(-c3c(Cl)cccc3Cl)c2c1