Reaction Details
TargetMitogen-activated protein kinase 14
LigandBDBM50175756
Substrate/Competitorn/a
Meas. Tech.ChEMBL_328205 (CHEMBL863917)
IC50 6.7±n/a nM
Citation Bao, JHunt, JAMiao, SRupprecht, KMStelmach, JELiu, LRuzek, RDSinclair, PJPivnichny, JVHop, CEKumar, SZaller, DMShoop, WLO'neill, EAO'keefe, SJThompson, CMCubbon, RMWang, RZhang, WXThompson, JEDoherty, JB p38 MAP kinase inhibitors: metabolically stabilized piperidine-substituted quinolinones and naphthyridinones. Bioorg Med Chem Lett16:64-8 (2005) 
 
Mitogen-activated protein kinase 14
Name:Mitogen-activated protein kinase 14
Type:Serine/threonine-protein kinase
Mol. Mass.:41286.76
Organism:Homo sapiens (Human)
Description:Q16539
Residue:360
BDBM50175756
NameBDBM50175756
Synonyms:CHEMBL199632 | methyl 2-(4-(5-(2-chloro-4-fluorophenyl)-1-(2,6-dichlorophenyl)-2-oxo-1,2-dihydroquinolin-7-yl)piperidin-1-yl)-2-methylpropanoate
TypeSmall organic molecule
Emp. Form.C31H28Cl3FN2O3
Mol. Mass.601.923
SMILESCOC(=O)C(C)(C)N1CCC(CC1)c1cc(-c2ccc(F)cc2Cl)c2ccc(=O)n(-c3c(Cl)cccc3Cl)c2c1