Reaction Details
TargetHistamine H3 receptor
LigandBDBM50175828
Substrate/Competitorn/a
Meas. Tech.ChEMBL_327756 (CHEMBL861797)
Ki 1.9±n/a nM
Citation Vaccaro, WDSher, RBerlin, MShih, NYAslanian, RSchwerdt, JHMcCormick, KDPiwinski, JJWest, REAnthes, JCWilliams, SMWu, RLShe, HSRivelli, MAMutter, JCCorboz, MRHey, JAFavreau, L Novel histamine H3 receptor antagonists based on the 4-[(1H-imidazol-4-yl)methyl]piperidine scaffold. Bioorg Med Chem Lett16:395-9 (2005) 
 
Histamine H3 receptor
Name:Histamine H3 receptor
Type:G Protein-Coupled Receptor (GPCR)
Mol. Mass.:48691.47
Organism:Homo sapiens (Human)
Description:Binding assays were using CHO cells stably expressing hH3R receptors.
Residue:445
BDBM50175828
NameBDBM50175828
Synonyms:3-(4-((1H-imidazol-4-yl)methyl)piperidin-1-yl)-N-(3-fluorophenyl)propanamide | CHEMBL200382
TypeSmall organic molecule
Emp. Form.C18H23FN4O
Mol. Mass.330.3998
SMILESFc1cccc(NC(=O)CCN2CCC(Cc3cnc[nH]3)CC2)c1