Reaction Details
TargetGenome polyprotein
LigandBDBM50228798
Substrate/Competitorn/a
Meas. Tech.ChEMBL_328004 (CHEMBL862736)
Ki 82900±n/a nM
Citation Yin, ZPatel, SJWang, WLWang, GChan, WLRao, KRAlam, JJeyaraj, DANgew, XPatel, VBeer, DLim, SPVasudevan, SGKeller, TH Peptide inhibitors of Dengue virus NS3 protease. Part 1: Warhead. Bioorg Med Chem Lett16:36-9 (2005) 
 
Genome polyprotein
Name:Genome polyprotein
Type:PROTEIN
Mol. Mass.:379613.45
Organism:Dengue virus 2
Description:ChEMBL_328004
Residue:3391
BDBM50228798
NameBDBM50228798
Synonyms:Bz-Nle-Lys-Arg-Arg-Benzoxazole N-((S)-1-((S)-6-amino-1-((S)-1-((S)-1-(benzo[d]oxazol-2-yl)-5-guanidino-1-oxopentan-2-ylamino)-5-guanidino-1-oxopentan-2-ylamino)-1-oxohexan-2-ylamino)-1-oxohexan-2-yl)benzamide
TypeSmall organic molecule
Emp. Form.C38H56N12O6
Mol. Mass.776.928
SMILES[#6]-[#6]-[#6]-[#6]-[#6@H](-[#7]-[#6](=O)-c1ccccc1)-[#6](=O)-[#7]-[#6@@H](-[#6]-[#6]-[#6]-[#6]-[#7])-[#6](=O)-[#7]-[#6@@H](-[#6]-[#6]-[#6]\[#7]=[#6](/[#7])-[#7])-[#6](=O)-[#7]-[#6@@H](-[#6]-[#6]-[#6]\[#7]=[#6](/[#7])-[#7])-[#6](=O)-c1nc2ccccc2o1