Reaction Details
TargetGenome polyprotein
LigandBDBM50175862
Substrate/Competitorn/a
Meas. Tech.ChEMBL_328004 (CHEMBL862736)
Ki>500000±n/a nM
Citation Yin, ZPatel, SJWang, WLWang, GChan, WLRao, KRAlam, JJeyaraj, DANgew, XPatel, VBeer, DLim, SPVasudevan, SGKeller, TH Peptide inhibitors of Dengue virus NS3 protease. Part 1: Warhead. Bioorg Med Chem Lett16:36-9 (2005) 
 
Genome polyprotein
Name:Genome polyprotein
Type:PROTEIN
Mol. Mass.:379613.45
Organism:Dengue virus 2
Description:ChEMBL_328004
Residue:3391
BDBM50175862
NameBDBM50175862
Synonyms:Bz-Nle-Lys-Arg-Arg-H CHEMBL200474 | N-BENZOYL-L-NORLEUCYL-L-LYSYL-L-ARGINYL-L-ARGININE
TypeSmall organic molecule
Emp. Form.C31H53N11O6
Mol. Mass.675.8226
SMILES[#6]-[#6]-[#6]-[#6]-[#6@H](-[#7]-[#6](=O)-c1ccccc1)-[#6](=O)-[#7]-[#6@@H](-[#6]-[#6]-[#6]-[#6]-[#7])-[#6](=O)-[#7]-[#6@@H](-[#6]-[#6]-[#6]\[#7]=[#6](\[#7])-[#7])-[#6](=O)-[#7]-[#6@@H](-[#6]-[#6]-[#6]\[#7]=[#6](\[#7])-[#7])-[#6](-[#8])=O