Reaction Details
TargetHeparanase
LigandBDBM50175936
Substrate/Competitorn/a
Meas. Tech.ChEMBL_327900 (CHEMBL869912)
IC50 150±n/a nM
Citation Pan, WMiao, HQXu, YJNavarro, ECTonra, JRCorcoran, ELahiji, AKussie, PKiselyov, ASWong, WCLiu, H 1-[4-(1H-Benzoimidazol-2-yl)-phenyl]-3-[4-(1H-benzoimidazol-2-yl)-phenyl]-urea derivatives as small molecule heparanase inhibitors. Bioorg Med Chem Lett16:409-12 (2005) 
 
Heparanase
Name:Heparanase
Type:PROTEIN
Mol. Mass.:61167.67
Organism:Homo sapiens (Human)
Description:ChEMBL_327900
Residue:543
BDBM50175936
NameBDBM50175936
Synonyms:1,3-bis(4-(6-methyl-1H-benzo[d]imidazol-2-yl)phenyl)urea | CHEMBL372737
TypeSmall organic molecule
Emp. Form.C29H24N6O
Mol. Mass.472.5405
SMILESCc1ccc2nc([nH]c2c1)-c1ccc(NC(=O)Nc2ccc(cc2)-c2nc3ccc(C)cc3[nH]2)cc1