Reaction Details
TargetGenome polyprotein
LigandBDBM50175972
Substrate/Competitorn/a
Meas. Tech.ChEMBL_328063 (CHEMBL863929)
Ki 138000±n/a nM
Citation Yin, ZPatel, SJWang, WLChan, WLRanga Rao, KRWang, GNgew, XPatel, VBeer, DKnox, JEMa, NLEhrhardt, CLim, SPVasudevan, SGKeller, TH Peptide inhibitors of dengue virus NS3 protease. Part 2: SAR study of tetrapeptide aldehyde inhibitors. Bioorg Med Chem Lett16:40-3 (2005) 
 
Genome polyprotein
Name:Genome polyprotein
Type:PROTEIN
Mol. Mass.:379613.45
Organism:Dengue virus 2
Description:ChEMBL_328004
Residue:3391
BDBM50175972
NameBDBM50175972
Synonyms:Bz-Nle-Lys-Arg-(p-Cl)Phe-H | CHEMBL199531
TypeSmall organic molecule
Emp. Form.C34H49ClN8O5
Mol. Mass.685.256
SMILES[#6]-[#6]-[#6]-[#6]-[#6@H](-[#7]-[#6](=O)-c1ccccc1)-[#6](=O)-[#7]-[#6@@H](-[#6]-[#6]-[#6]-[#6]-[#7])-[#6](=O)-[#7]-[#6@@H](-[#6]-[#6]-[#6]\[#7]=[#6](\[#7])-[#7])-[#6](=O)-[#7]-[#6@@H](-[#6]-c1ccc(Cl)cc1)-[#6]=O