Reaction Details
TargetGenome polyprotein
LigandBDBM50175974
Substrate/Competitorn/a
Meas. Tech.ChEMBL_328063 (CHEMBL863929)
Ki 7500±n/a nM
Citation Yin, ZPatel, SJWang, WLChan, WLRanga Rao, KRWang, GNgew, XPatel, VBeer, DKnox, JEMa, NLEhrhardt, CLim, SPVasudevan, SGKeller, TH Peptide inhibitors of dengue virus NS3 protease. Part 2: SAR study of tetrapeptide aldehyde inhibitors. Bioorg Med Chem Lett16:40-3 (2005) 
 
Genome polyprotein
Name:Genome polyprotein
Type:PROTEIN
Mol. Mass.:379613.45
Organism:Dengue virus 2
Description:ChEMBL_328004
Residue:3391
BDBM50175974
NameBDBM50175974
Synonyms:Bz-Nle-Lys-Arg-Trp-H | CHEMBL433993
TypeSmall organic molecule
Emp. Form.C36H51N9O5
Mol. Mass.689.8474
SMILESCCCC[C@H](NC(=O)c1ccccc1)C(=O)N[C@@H](CCCCN)C(=O)N[C@@H](CCCN=C(N)N)C(=O)N[C@@H](Cc1c[nH]c2ccccc12)C=O