Reaction Details
TargetMitogen-activated protein kinase 14
LigandBDBM50176013
Substrate/Competitorn/a
Meas. Tech.ChEMBL_327352 (CHEMBL863439)
IC50 0.7±n/a nM
Citation Revesz, LBlum, EDi Padova, FEBuhl, TFeifel, RGram, HHiestand, PManning, UNeumann, URucklin, G Pyrazoloheteroaryls: novel p38alpha MAP kinase inhibiting scaffolds with oral activity. Bioorg Med Chem Lett16:262-6 (2005) 
 
Mitogen-activated protein kinase 14
Name:Mitogen-activated protein kinase 14
Type:Enzyme
Mol. Mass.:41281.22
Organism:Mus musculus (mouse)
Description:The full-length open reading frame of murine p38 alpha was cloned and expressed in E. coli.. Soluble murine p38R was extracted from cell pellets and purified using ion-exchange chromatography.
Residue:360
BDBM50176013
NameBDBM50176013
Synonyms:3-(6-(2,4-difluorophenylamino)-1H-pyrazolo[3,4-b]pyridin-3-yl)-4-methoxy-N-(tetrahydro-2H-pyran-4-yl)benzamide | CHEMBL200040
TypeSmall organic molecule
Emp. Form.C25H23F2N5O3
Mol. Mass.479.4786
SMILESCOc1ccc(cc1-c1[nH]nc2nc(Nc3ccc(F)cc3F)ccc12)C(=O)NC1CCOCC1