Reaction Details
TargetD(2) dopamine receptor
LigandBDBM50176031
Substrate/Competitorn/a
Meas. Tech.ChEMBL_320895 (CHEMBL872394)
Ki 2.1±n/a nM
Citation Smid, PCoolen, HKKeizer, HGvan Hes, Rde Moes, JPden Hartog, APStork, BPlekkenpol, RHNiemann, LCStroomer, CNTulp, MTvan Stuivenberg, HHMcCreary, ACHesselink, MBHerremans, AHKruse, CG Synthesis, structure-activity relationships, and biological properties of 1-heteroaryl-4-[omega-(1H-indol-3-yl)alkyl]piperazines, novel potential antipsychotics combining potent dopamine D2 receptor antagonism with potent serotonin reuptake inhibition. J Med Chem48:6855-69 (2005) 
 
D(2) dopamine receptor
Name:D(2) dopamine receptor
Type:Cell-surface receptors
Mol. Mass.:50647.10
Organism:Homo sapiens (Human)
Description:P14416
Residue:443
BDBM50176031
NameBDBM50176031
Synonyms:6-Chloro-3-{3-[4-(2,3-dihydro-benzo[1,4]dioxin-5-yl)-piperazin-1-yl]-propyl}-1H-indole | CHEMBL194240
TypeSmall organic molecule
Emp. Form.C23H26ClN3O2
Mol. Mass.411.924
SMILESClc1ccc2c(CCCN3CCN(CC3)c3cccc4OCCOc34)c[nH]c2c1