Reaction Details
TargetSodium-dependent serotonin transporter
LigandBDBM50176027
Substrate/Competitorn/a
Meas. Tech.ChEMBL_320901 (CHEMBL872400)
Ki 7.4±n/a nM
Citation Smid, PCoolen, HKKeizer, HGvan Hes, Rde Moes, JPden Hartog, APStork, BPlekkenpol, RHNiemann, LCStroomer, CNTulp, MTvan Stuivenberg, HHMcCreary, ACHesselink, MBHerremans, AHKruse, CG Synthesis, structure-activity relationships, and biological properties of 1-heteroaryl-4-[omega-(1H-indol-3-yl)alkyl]piperazines, novel potential antipsychotics combining potent dopamine D2 receptor antagonism with potent serotonin reuptake inhibition. J Med Chem48:6855-69 (2005) 
 
Sodium-dependent serotonin transporter
Name:Sodium-dependent serotonin transporter
Type:Multi-pass membrane protein
Mol. Mass.:70168.43
Organism:Rattus norvegicus (rat)
Description:P31652
Residue:630
BDBM50176027
NameBDBM50176027
Synonyms:5-{4-[3-(1H-Indol-3-yl)-propyl]-piperazin-1-yl}-1-methyl-1,2,3,4-tetrahydro-quinoline | CHEMBL198041
TypeSmall organic molecule
Emp. Form.C25H32N4
Mol. Mass.388.5484
SMILESCN1CCCc2c1cccc2N1CCN(CCCc2c[nH]c3ccccc23)CC1