Reaction Details
TargetD(2) dopamine receptor
LigandBDBM50176035
Substrate/Competitorn/a
Meas. Tech.ChEMBL_320895 (CHEMBL872394)
Ki 4.5±n/a nM
Citation Smid, PCoolen, HKKeizer, HGvan Hes, Rde Moes, JPden Hartog, APStork, BPlekkenpol, RHNiemann, LCStroomer, CNTulp, MTvan Stuivenberg, HHMcCreary, ACHesselink, MBHerremans, AHKruse, CG Synthesis, structure-activity relationships, and biological properties of 1-heteroaryl-4-[omega-(1H-indol-3-yl)alkyl]piperazines, novel potential antipsychotics combining potent dopamine D2 receptor antagonism with potent serotonin reuptake inhibition. J Med Chem48:6855-69 (2005) 
 
D(2) dopamine receptor
Name:D(2) dopamine receptor
Type:Cell-surface receptors
Mol. Mass.:50647.10
Organism:Homo sapiens (Human)
Description:P14416
Residue:443
BDBM50176035
NameBDBM50176035
Synonyms:8-{4-[3-(1H-Indol-3-yl)-propyl]-piperazin-1-yl}-2-methyl-4H-benzo[1,4]oxazin-3-one | CHEMBL198070
TypeSmall organic molecule
Emp. Form.C24H28N4O2
Mol. Mass.404.5047
SMILESCC1Oc2c(NC1=O)cccc2N1CCN(CCCc2c[nH]c3ccccc23)CC1