Reaction Details
TargetSodium-dependent serotonin transporter
LigandBDBM50176040
Substrate/Competitorn/a
Meas. Tech.ChEMBL_320901 (CHEMBL872400)
Ki 2.4±n/a nM
Citation Smid, PCoolen, HKKeizer, HGvan Hes, Rde Moes, JPden Hartog, APStork, BPlekkenpol, RHNiemann, LCStroomer, CNTulp, MTvan Stuivenberg, HHMcCreary, ACHesselink, MBHerremans, AHKruse, CG Synthesis, structure-activity relationships, and biological properties of 1-heteroaryl-4-[omega-(1H-indol-3-yl)alkyl]piperazines, novel potential antipsychotics combining potent dopamine D2 receptor antagonism with potent serotonin reuptake inhibition. J Med Chem48:6855-69 (2005) 
 
Sodium-dependent serotonin transporter
Name:Sodium-dependent serotonin transporter
Type:Multi-pass membrane protein
Mol. Mass.:70168.43
Organism:Rattus norvegicus (rat)
Description:P31652
Residue:630
BDBM50176040
NameBDBM50176040
Synonyms:(R)-8-{4-[3-(7-Fluoro-1H-indol-3-yl)-propyl]-piperazin-1-yl}-2-methyl-4H-benzo[1,4]oxazin-3-one | CHEMBL196172
TypeSmall organic molecule
Emp. Form.C24H27FN4O2
Mol. Mass.422.4952
SMILESC[C@H]1Oc2c(NC1=O)cccc2N1CCN(CCCc2c[nH]c3c(F)cccc23)CC1