Reaction Details
TargetSodium-dependent serotonin transporter
LigandBDBM50176042
Substrate/Competitorn/a
Meas. Tech.ChEMBL_320901 (CHEMBL872400)
Ki 0.50±n/a nM
Citation Smid, PCoolen, HKKeizer, HGvan Hes, Rde Moes, JPden Hartog, APStork, BPlekkenpol, RHNiemann, LCStroomer, CNTulp, MTvan Stuivenberg, HHMcCreary, ACHesselink, MBHerremans, AHKruse, CG Synthesis, structure-activity relationships, and biological properties of 1-heteroaryl-4-[omega-(1H-indol-3-yl)alkyl]piperazines, novel potential antipsychotics combining potent dopamine D2 receptor antagonism with potent serotonin reuptake inhibition. J Med Chem48:6855-69 (2005) 
 
Sodium-dependent serotonin transporter
Name:Sodium-dependent serotonin transporter
Type:Multi-pass membrane protein
Mol. Mass.:70168.43
Organism:Rattus norvegicus (rat)
Description:P31652
Residue:630
BDBM50176042
NameBDBM50176042
Synonyms:5-Chloro-3-{3-[4-(2,3-dihydro-benzo[1,4]dioxin-5-yl)-piperazin-1-yl]-propyl}-1H-indole | CHEMBL370359
TypeSmall organic molecule
Emp. Form.C23H26ClN3O2
Mol. Mass.411.924
SMILESClc1ccc2[nH]cc(CCCN3CCN(CC3)c3cccc4OCCOc34)c2c1