Reaction Details
TargetCathepsin K
LigandBDBM50002400
Substrate/Competitorn/a
Meas. Tech.ChEMBL_321689 (CHEMBL872184)
Ki 12±n/a nM
Citation Marquis, RWJames, IZeng, JTrout, REThompson, SRahman, AYamashita, DSXie, RRu, YGress, CJBlake, SLark, MAHwang, SMTomaszek, TOffen, PHead, MSCummings, MDVeber, DF Azepanone-based inhibitors of human cathepsin L. J Med Chem48:6870-8 (2005) 
 
Cathepsin K
Name:Cathepsin K
Type:Enzyme
Mol. Mass.:36975.68
Organism:Homo sapiens (Human)
Description:P43235
Residue:329
BDBM50002400
NameBDBM50002400
Synonyms:CHEMBL382286
TypeSmall organic molecule
Emp. Form.C28H32N4O5S
Mol. Mass.536.642
SMILESCC(C)C[C@H](NC(=O)c1cccc2ccccc12)C(=O)N[C@H]1CCCN(CC1=O)S(=O)(=O)c1ccccn1