Reaction Details
TargetProcathepsin L
LigandBDBM50002400
Substrate/Competitorn/a
Meas. Tech.ChEMBL_321690 (CHEMBL872185)
Ki 1.4±n/a nM
Citation Marquis, RWJames, IZeng, JTrout, REThompson, SRahman, AYamashita, DSXie, RRu, YGress, CJBlake, SLark, MAHwang, SMTomaszek, TOffen, PHead, MSCummings, MDVeber, DF Azepanone-based inhibitors of human cathepsin L. J Med Chem48:6870-8 (2005) 
 
Procathepsin L
Name:Procathepsin L
Type:Enzyme
Mol. Mass.:37557.19
Organism:Homo sapiens (Human)
Description:Purchased from Calbiochem (San Diego, CA).
Residue:333
BDBM50002400
NameBDBM50002400
Synonyms:CHEMBL382286
TypeSmall organic molecule
Emp. Form.C28H32N4O5S
Mol. Mass.536.642
SMILESCC(C)C[C@H](NC(=O)c1cccc2ccccc12)C(=O)N[C@H]1CCCN(CC1=O)S(=O)(=O)c1ccccn1