Reaction Details
TargetCathepsin S
LigandBDBM50084650
Substrate/Competitorn/a
Meas. Tech.ChEMBL_321691 (CHEMBL872186)
Ki 0.26±n/a nM
Citation Marquis, RWJames, IZeng, JTrout, REThompson, SRahman, AYamashita, DSXie, RRu, YGress, CJBlake, SLark, MAHwang, SMTomaszek, TOffen, PHead, MSCummings, MDVeber, DF Azepanone-based inhibitors of human cathepsin L. J Med Chem48:6870-8 (2005) 
 
Cathepsin S
Name:Cathepsin S
Type:Protein
Mol. Mass.:37507.38
Organism:Homo sapiens (Human)
Description:P25774
Residue:331
BDBM50084650
NameBDBM50084650
Synonyms:CHEMBL177914 {1-[1-Formyl-2-(4-hydroxy-phenyl)-ethylcarbamoyl]-2-phenyl-ethyl}-carbamic acid benzyl ester(Cbz-Phe-Tyr-CHO)
TypeSmall organic molecule
Emp. Form.C26H26N2O5
Mol. Mass.446.495
SMILESOc1ccc(C[C@H](NC(=O)[C@H](Cc2ccccc2)NC(=O)OCc2ccccc2)C=O)cc1