Reaction Details
TargetProcathepsin L
LigandBDBM50002366
Substrate/Competitorn/a
Meas. Tech.ChEMBL_321690 (CHEMBL872185)
Ki 5±n/a nM
Citation Marquis, RWJames, IZeng, JTrout, REThompson, SRahman, AYamashita, DSXie, RRu, YGress, CJBlake, SLark, MAHwang, SMTomaszek, TOffen, PHead, MSCummings, MDVeber, DF Azepanone-based inhibitors of human cathepsin L. J Med Chem48:6870-8 (2005) 
 
Procathepsin L
Name:Procathepsin L
Type:Enzyme
Mol. Mass.:37557.19
Organism:Homo sapiens (Human)
Description:Purchased from Calbiochem (San Diego, CA).
Residue:333
BDBM50002366
NameBDBM50002366
Synonyms:CHEMBL433985
TypeSmall organic molecule
Emp. Form.C27H31N5O5S
Mol. Mass.537.631
SMILESCC(C)C[C@H](NC(=O)c1ccc2ccccc2n1)C(=O)N[C@H]1CCCN(CC1=O)S(=O)(=O)c1ccccn1