Reaction Details
TargetGlucagon receptor
LigandBDBM50075780
Substrate/Competitorn/a
Meas. Tech.ChEMBL_321216 (CHEMBL884635)
IC50 32±n/a nM
Citation Wang, NDeLisle, RKDiller, DJ Fast small molecule similarity searching with multiple alignment profiles of molecules represented in one-dimension. J Med Chem48:6980-90 (2005) 
 
Glucagon receptor
Name:Glucagon receptor
Type:Enzyme
Mol. Mass.:54026.92
Organism:Homo sapiens (Human)
Description:P47871
Residue:477
BDBM50075780
NameBDBM50075780
Synonyms:4-[5-(4-Chloro-phenyl)-3-isopropyl-1H-pyrrol-2-yl]-pyridine | CHEMBL158548
TypeSmall organic molecule
Emp. Form.C18H17ClN2
Mol. Mass.296.794
SMILESCC(C)c1cc([nH]c1-c1ccncc1)-c1ccc(Cl)cc1