Reaction Details
TargetD(3) dopamine receptor
LigandBDBM50176070
Substrate/Competitorn/a
Meas. Tech.ChEMBL_320927 (CHEMBL881471)
Ki 0.13±n/a nM
Citation Turolla, EAMatarrese, MBelloli, SMoresco, RMSimonelli, PTodde, SFazio, FMagni, FKienle, MGLeopoldo, MBerardi, FColabufo, NALacivita, EPerrone, R 11C-labeling of n-[4-[4-(2,3-dichlorophenyl)piperazin-1-yl]butyl]arylcarboxamide derivatives and evaluation as potential radioligands for PET imaging of dopamine D3 receptors. J Med Chem48:7018-23 (2005) 
 
D(3) dopamine receptor
Name:D(3) dopamine receptor
Type:Protein
Mol. Mass.:49540.58
Organism:Rattus norvegicus (Rat)
Description:P19020
Residue:446
BDBM50176070
NameBDBM50176070
Synonyms:7-Methoxy-benzofuran-2-carboxylic acid {4-[4-(2,3-dichloro-phenyl)-piperazin-1-yl]-butyl}-amide N-(4-(4-(2,3-dichlorophenyl)piperazin-1-yl)butyl)-7-methoxybenzofuran-2-carboxamide
TypeSmall organic molecule
Emp. Form.C24H27Cl2N3O3
Mol. Mass.476.395
SMILESCOc1cccc2cc(oc12)C(=O)NCCCCN1CCN(CC1)c1cccc(Cl)c1Cl