Reaction Details
TargetIntegrase
LigandBDBM50176117
Substrate/Competitorn/a
Meas. Tech.ChEMBL_321411 (CHEMBL881942)
IC50 970±n/a nM
Citation Barreca, MLFerro, SRao, ADe Luca, LZappalà, MMonforte, AMDebyser, ZWitvrouw, MChimirri, A Pharmacophore-based design of HIV-1 integrase strand-transfer inhibitors. J Med Chem48:7084-8 (2005) 
 
Integrase
Name:Integrase
Synonyms:Human immunodeficiency virus type 1 integrase
Type:PROTEIN
Mol. Mass.:32231.48
Organism:Human immunodeficiency virus 1
Description:ChEMBL_90865
Residue:288
BDBM50176117
NameBDBM50176117
TypeSmall organic molecule
Emp. Form.C19H14ClNO4
Mol. Mass.355.772
SMILESOC(=O)C(=O)CC(=O)c1cn(Cc2ccccc2)c2ccc(Cl)cc12