Reaction Details
TargetIntegrase
LigandBDBM50123467
Substrate/Competitorn/a
Meas. Tech.ChEMBL_321311 (CHEMBL881407)
IC50 1000±n/a nM
Citation Barreca, MLFerro, SRao, ADe Luca, LZappalà, MMonforte, AMDebyser, ZWitvrouw, MChimirri, A Pharmacophore-based design of HIV-1 integrase strand-transfer inhibitors. J Med Chem48:7084-8 (2005) 
 
Integrase
Name:Integrase
Synonyms:Human immunodeficiency virus type 1 integrase
Type:PROTEIN
Mol. Mass.:32231.48
Organism:Human immunodeficiency virus 1
Description:ChEMBL_90865
Residue:288
BDBM50123467
NameBDBM50123467
TypeSmall organic molecule
Emp. Form.C21H15NO3
Mol. Mass.329.3487
SMILESOc1c(oc2cccnc12)C(=O)c1cccc(Cc2ccccc2)c1