Reaction Details
TargetIntegrase
LigandBDBM50176126
Substrate/Competitorn/a
Meas. Tech.ChEMBL_321411 (CHEMBL881942)
IC50 1590±n/a nM
Citation Barreca, MLFerro, SRao, ADe Luca, LZappalà, MMonforte, AMDebyser, ZWitvrouw, MChimirri, A Pharmacophore-based design of HIV-1 integrase strand-transfer inhibitors. J Med Chem48:7084-8 (2005) 
 
Integrase
Name:Integrase
Synonyms:Human immunodeficiency virus type 1 integrase
Type:PROTEIN
Mol. Mass.:32231.48
Organism:Human immunodeficiency virus 1
Description:ChEMBL_90865
Residue:288
BDBM50176126
NameBDBM50176126
TypeSmall organic molecule
Emp. Form.C19H13ClFNO4
Mol. Mass.373.762
SMILESOC(=O)C(=O)CC(=O)c1cn(Cc2ccc(F)cc2)c2ccc(Cl)cc12