Reaction Details
TargetIntegrase
LigandBDBM50095504
Substrate/Competitorn/a
Meas. Tech.ChEMBL_321311 (CHEMBL881407)
IC50 250±n/a nM
Citation Barreca, MLFerro, SRao, ADe Luca, LZappalà, MMonforte, AMDebyser, ZWitvrouw, MChimirri, A Pharmacophore-based design of HIV-1 integrase strand-transfer inhibitors. J Med Chem48:7084-8 (2005) 
 
Integrase
Name:Integrase
Synonyms:Human immunodeficiency virus type 1 integrase
Type:PROTEIN
Mol. Mass.:32231.48
Organism:Human immunodeficiency virus 1
Description:ChEMBL_90865
Residue:288
BDBM50095504
NameBDBM50095504
TypeSmall organic molecule
Emp. Form.C17H13FO4
Mol. Mass.300.2811
SMILESOC(=O)C(=O)CC(=O)c1cccc(Cc2cccc(F)c2)c1