Reaction Details
TargetIntegrase
LigandBDBM50176118
Substrate/Competitorn/a
Meas. Tech.ChEMBL_321394 (CHEMBL880629)
IC50 30±n/a nM
Citation Barreca, MLFerro, SRao, ADe Luca, LZappalà, MMonforte, AMDebyser, ZWitvrouw, MChimirri, A Pharmacophore-based design of HIV-1 integrase strand-transfer inhibitors. J Med Chem48:7084-8 (2005) 
 
Integrase
Name:Integrase
Synonyms:Human immunodeficiency virus type 1 integrase
Type:PROTEIN
Mol. Mass.:32231.48
Organism:Human immunodeficiency virus 1
Description:ChEMBL_90865
Residue:288
BDBM50176118
NameBDBM50176118
TypeSmall organic molecule
Emp. Form.C21H18ClNO4
Mol. Mass.383.825
SMILESCCOC(=O)C(=O)CC(=O)c1cn(Cc2ccccc2)c2ccc(Cl)cc12