Reaction Details
TargetIntegrase
LigandBDBM50176116
Substrate/Competitorn/a
Meas. Tech.ChEMBL_321411 (CHEMBL881942)
IC50 2710±n/a nM
Citation Barreca, MLFerro, SRao, ADe Luca, LZappalà, MMonforte, AMDebyser, ZWitvrouw, MChimirri, A Pharmacophore-based design of HIV-1 integrase strand-transfer inhibitors. J Med Chem48:7084-8 (2005) 
 
Integrase
Name:Integrase
Synonyms:Human immunodeficiency virus type 1 integrase
Type:PROTEIN
Mol. Mass.:32231.48
Organism:Human immunodeficiency virus 1
Description:ChEMBL_90865
Residue:288
BDBM50176116
NameBDBM50176116
TypeSmall organic molecule
Emp. Form.C20H16FNO5
Mol. Mass.369.3431
SMILESCOc1ccc2n(Cc3ccc(F)cc3)cc(C(=O)CC(=O)C(O)=O)c2c1