Reaction Details
TargetCoagulation factor X
LigandBDBM50176250
Substrate/Competitorn/a
Meas. Tech.ChEMBL_334349 (CHEMBL862208)
Ki 3±n/a nM
Citation Young, WBSprengeler, PShrader, WDLi, YRai, RVerner, EJenkins, TFatheree, PKolesnikov, AJanc, JWCregar, LElrod, KKatz, B Generation of potent coagulation protease inhibitors utilizing zinc-mediated chelation. Bioorg Med Chem Lett16:710-3 (2005) 
 
Coagulation factor X
Name:Coagulation factor X
Type:Enzyme
Mol. Mass.:54726.60
Organism:Homo sapiens (Human)
Description:n/a
Residue:488
BDBM50176250
NameBDBM50176250
Synonyms:2-((5-fluoro-7-methoxy-1H-benzo[d]imidazol-2-yl)methyl)-1H-benzo[d]imidazole-5-carboxamidine | CHEMBL201843
TypeSmall organic molecule
Emp. Form.C17H15FN6O
Mol. Mass.338.339
SMILESCOc1cc(F)cc2[nH]c(Cc3nc4ccc(cc4[nH]3)C(N)=N)nc12