Reaction Details
Target5-hydroxytryptamine receptor 2C
LigandBDBM50176265
Substrate/Competitorn/a
Meas. Tech.ChEMBL_331166 (CHEMBL854093)
EC50 6.9±n/a nM
Citation Adams, DRBentley, JMBenwell, KRBickerdike, MJBodkin, CDCliffe, IADourish, CTGeorge, ARKennett, GAKnight, ARMalcolm, CSMansell, HLMisra, AQuirk, KRoffey, JRVickers, SP Pyrrolo(iso)quinoline derivatives as 5-HT(2C) receptor agonists. Bioorg Med Chem Lett16:677-80 (2005) 
 
5-hydroxytryptamine receptor 2C
Name:5-hydroxytryptamine receptor 2C
Type:G Protein-Coupled Receptor (GPCR)
Mol. Mass.:51836.79
Organism:Homo sapiens (Human)
Description:P28335
Residue:458
BDBM50176265
NameBDBM50176265
Synonyms:(S)-1-(5-chloro-1H-pyrrolo[2,3-f]quinolin-1-yl)propan-2-amine | CHEMBL201454
TypeSmall organic molecule
Emp. Form.C14H14ClN3
Mol. Mass.259.734
SMILESC[C@H](N)Cn1ccc2cc(Cl)c3ncccc3c12