Reaction Details
TargetCytochrome P450 2D6
LigandBDBM50176370
Substrate/Competitorn/a
Meas. Tech.ChEMBL_332935 (CHEMBL854082)
IC50 3400±n/a nM
Citation Chu, GHGu, MCassel, JABelanger, SStabley, GJDeHaven, RNConway-James, NKoblish, MLittle, PJDeHaven-Hudkins, DLDolle, RE Novel phenylamino acetamide derivatives as potent and selective kappa opioid receptor agonists. Bioorg Med Chem Lett16:645-8 (2005) 
 
Cytochrome P450 2D6
Name:Cytochrome P450 2D6
Type:Protein
Mol. Mass.:55774.82
Organism:Homo sapiens (Human)
Description:P10635
Residue:497
BDBM50176370
NameBDBM50176370
Synonyms:CHEMBL201572 | N-((S)-2-((S)-3-hydroxypyrrolidin-1-yl)-1-phenylethyl)-N-methyl-2-(4-nitrophenylamino)acetamide
TypeSmall organic molecule
Emp. Form.C21H26N4O4
Mol. Mass.398.4555
SMILESCN([C@H](CN1CC[C@H](O)C1)c1ccccc1)C(=O)CNc1ccc(cc1)[N+]([O-])=O