Reaction Details
TargetCytochrome P450 2D6
LigandBDBM50176365
Substrate/Competitorn/a
Meas. Tech.ChEMBL_332935 (CHEMBL854082)
IC50 190±n/a nM
Citation Chu, GHGu, MCassel, JABelanger, SStabley, GJDeHaven, RNConway-James, NKoblish, MLittle, PJDeHaven-Hudkins, DLDolle, RE Novel phenylamino acetamide derivatives as potent and selective kappa opioid receptor agonists. Bioorg Med Chem Lett16:645-8 (2005) 
 
Cytochrome P450 2D6
Name:Cytochrome P450 2D6
Type:Protein
Mol. Mass.:55774.82
Organism:Homo sapiens (Human)
Description:P10635
Residue:497
BDBM50176365
NameBDBM50176365
Synonyms:CHEMBL201905 | N-((S)-2-((S)-3-hydroxypyrrolidin-1-yl)-1-phenylethyl)-N-methyl-2-(4-(trifluoromethyl)phenylamino)acetamide
TypeSmall organic molecule
Emp. Form.C22H26F3N3O2
Mol. Mass.421.4559
SMILESCN([C@H](CN1CC[C@H](O)C1)c1ccccc1)C(=O)CNc1ccc(cc1)C(F)(F)F