Reaction Details
TargetcAMP-specific 3',5'-cyclic phosphodiesterase 4D
LigandBDBM50176377
Substrate/Competitorn/a
Meas. Tech.ChEMBL_334424 (CHEMBL862505)
IC50 3±n/a nM
Citation Chambers, RJAbrams, KCastleberry, TACheng, JBFisher, DAKamath, AVMarfat, ANettleton, DOPillar, JDSalter, EDSheils, ALShirley, JTTurner, CRUmland, JPLam, KT A new chemical tool for exploring the role of the PDE4D isozyme in leukocyte function. Bioorg Med Chem Lett16:718-21 (2005) 
 
cAMP-specific 3',5'-cyclic phosphodiesterase 4D
Name:cAMP-specific 3',5'-cyclic phosphodiesterase 4D
Type:Protein
Mol. Mass.:91092.69
Organism:Homo sapiens (Human)
Description:Q08499
Residue:809
BDBM50176377
NameBDBM50176377
Synonyms:(R)-2-(4-fluorophenoxy)-N-(1-(thiophen-2-yl)ethyl)nicotinamide | CHEMBL204449
TypeSmall organic molecule
Emp. Form.C18H15FN2O2S
Mol. Mass.342.387
SMILESC[C@@H](NC(=O)c1cccnc1Oc1ccc(F)cc1)c1cccs1